BDBM56316 1-(5-Acetyl-2,4-dimethyl-1H-pyrrol-3-yl)-ethanone::1-(5-acetyl-2,4-dimethyl-1H-pyrrol-3-yl)ethanone::1-(5-ethanoyl-2,4-dimethyl-1H-pyrrol-3-yl)ethanone::MLS000525257::SMR000122131::cid_200285
SMILES CC(=O)c1[nH]c(C)c(C(C)=O)c1C
InChI Key InChIKey=QQDLJFDTROVUDP-UHFFFAOYSA-N
Data  1 IC50
  Tab Delimited (TSV)   2D SDfile   Computed 3D by Vconf -m prep SDfile
Find this compound or compounds like it in BindingDB:
Activity Spreadsheet -- Enzyme Inhibition Constant Data from BindingDB
Found 1 hit for monomerid = 56316
TargetKallikrein-5(Homo sapiens (Human))
Pcmd
Curated by PubChem BioAssay
LigandPNGBDBM56316(1-(5-Acetyl-2,4-dimethyl-1H-pyrrol-3-yl)-ethanone ...)
Affinity DataIC50:  5.00E+4nM. Assay description: Molecular Library Screening Center Network (MLSCN) Penn Center for Molecular Discovery (PCMD) Assay Provider: Scott L. Diamond, University of Pennsy...
In DepthDetails PCBioAssay