BDBM56476 3-ethylphenyl 1H-1,2,3,4-tetraazol-5-yl ether::5-(3-ethylphenoxy)-2H-1,2,3,4-tetrazole::5-(3-ethylphenoxy)-2H-tetrazole::MLS000327767::SMR000180733::cid_5152261
SMILES CCc1cccc(Oc2nnn[nH]2)c1
InChI Key InChIKey=YRXBMPBCRPCAOX-UHFFFAOYSA-N
Data  1 IC50
  Tab Delimited (TSV)   2D SDfile   Computed 3D by Vconf -m prep SDfile
Find this compound or compounds like it in BindingDB:
Activity Spreadsheet -- Enzyme Inhibition Constant Data from BindingDB
Found 1 hit for monomerid = 56476
TargetKallikrein-5(Homo sapiens (Human))
Pcmd
Curated by PubChem BioAssay
LigandPNGBDBM56476(3-ethylphenyl 1H-1,2,3,4-tetraazol-5-yl ether | 5-...)
Affinity DataIC50:  5.00E+4nM. Assay description: Molecular Library Screening Center Network (MLSCN) Penn Center for Molecular Discovery (PCMD) Assay Provider: Scott L. Diamond, University of Pennsy...
In DepthDetails PCBioAssay