BDBM56555 4-Methoxy-benzoic acid N'-(5,5-dimethyl-3-oxo-cyclohex-1-enyl)-hydrazide::MLS000566889::N'-(3-keto-5,5-dimethyl-cyclohexen-1-yl)-4-methoxy-benzohydrazide::N'-(5,5-dimethyl-3-oxidanylidene-cyclohexen-1-yl)-4-methoxy-benzohydrazide::N'-(5,5-dimethyl-3-oxo-1-cyclohexenyl)-4-methoxybenzohydrazide::N'-(5,5-dimethyl-3-oxocyclohexen-1-yl)-4-methoxybenzohydrazide::SMR000174541::cid_739442
SMILES COc1ccc(cc1)C(=O)NNC1=CC(=O)CC(C)(C)C1
InChI Key InChIKey=KZIXAWSSNZVJGA-UHFFFAOYSA-N
Data  1 IC50
  Tab Delimited (TSV)   2D SDfile   Computed 3D by Vconf -m prep SDfile
Find this compound or compounds like it in BindingDB:
Activity Spreadsheet -- Enzyme Inhibition Constant Data from BindingDB
Found 1 hit for monomerid = 56555
TargetKallikrein-5(Homo sapiens (Human))
Pcmd
Curated by PubChem BioAssay
LigandPNGBDBM56555(4-Methoxy-benzoic acid N'-(5,5-dimethyl-3-oxo-...)
Affinity DataIC50:  5.00E+4nM. Assay description: Molecular Library Screening Center Network (MLSCN) Penn Center for Molecular Discovery (PCMD) Assay Provider: Scott L. Diamond, University of Pennsy...
In DepthDetails PCBioAssay