BDBM56714 (3-chloro-4-pyridyl)amine::3-chloranylpyridin-4-amine::3-chloro-4-pyridinamine::3-chloropyridin-4-amine::MLS001033537::SMR000363940::cid_581853
SMILES Nc1ccncc1Cl
InChI Key InChIKey=KJBKPRMEMJKXDV-UHFFFAOYSA-N
Data  1 IC50
  Tab Delimited (TSV)   2D SDfile   Computed 3D by Vconf -m prep SDfile
Find this compound or compounds like it in BindingDB:
Activity Spreadsheet -- Enzyme Inhibition Constant Data from BindingDB
Found 1 hit for monomerid = 56714
TargetKallikrein-5(Homo sapiens (Human))
Pcmd
Curated by PubChem BioAssay
LigandPNGBDBM56714((3-chloro-4-pyridyl)amine | 3-chloranylpyridin-4-a...)
Affinity DataIC50:  5.00E+4nM. Assay description: Molecular Library Screening Center Network (MLSCN) Penn Center for Molecular Discovery (PCMD) Assay Provider: Scott L. Diamond, University of Pennsy...
In DepthDetails PCBioAssay