BDBM56855 2-(methanesulfonamido)-6-methyl-4,5,6,7-tetrahydro-1-benzothiophene-3-carboxylic acid ethyl ester::2-(methanesulfonamido)-6-methyl-4,5,6,7-tetrahydrobenzothiophene-3-carboxylic acid ethyl ester::MLS000109398::SMR000105341::cid_3127949::ethyl 2-(methanesulfonamido)-6-methyl-4,5,6,7-tetrahydro-1-benzothiophene-3-carboxylate::ethyl 6-methyl-2-(methylsulfonylamino)-4,5,6,7-tetrahydro-1-benzothiophene-3-carboxylate
SMILES CCOC(=O)c1c(NS(C)(=O)=O)sc2CC(C)CCc12
InChI Key InChIKey=JYCBBNZKFZJOHB-UHFFFAOYSA-N
Data  1 IC50
  Tab Delimited (TSV)   2D SDfile   Computed 3D by Vconf -m prep SDfile
Find this compound or compounds like it in BindingDB:
Activity Spreadsheet -- Enzyme Inhibition Constant Data from BindingDB
Found 1 hit for monomerid = 56855
TargetDNA repair protein RAD51 homolog 1(Homo sapiens (Human))
Pcmd
Curated by PubChem BioAssay
LigandPNGBDBM56855(2-(methanesulfonamido)-6-methyl-4,5,6,7-tetrahydro...)
Affinity DataIC50:  8.50E+4nM. Assay description: Project Title: A screen for modulators of human Rad51, a key DNA repair protein Application Number: MH084119 Assay Submitter: Dr. Alex Mazin Submitte...
In DepthDetails PCBioAssay