BDBM5701 2-amino-5-thio-substituted thiazole 69::N-{5-[(2-phenoxyethyl)sulfanyl]-1,3-thiazol-2-yl}acetamide
SMILES CC(=O)Nc1ncc(SCCOc2ccccc2)s1
InChI Key InChIKey=VCJNEAXFDDEMAV-UHFFFAOYSA-N
Data  1 IC50
  Tab Delimited (TSV)   2D SDfile   Computed 3D by Vconf -m prep SDfile
Find this compound or compounds like it in BindingDB:
Activity Spreadsheet -- Enzyme Inhibition Constant Data from BindingDB
Found 1 hit for monomerid = 5701
TargetCyclin-dependent kinase 2/G1/S-specific cyclin-E1(Homo sapiens (Human))
Bristol-Myers Squibb Pharmaceutical Research Institute
LigandPNGBDBM5701(2-amino-5-thio-substituted thiazole 69 | N-{5-[(2-...)
Affinity DataIC50: >1.00E+3nM. Assay description:  The enzyme was assayed with substrate in the presence of 25 uM ATP/[gamma-33P] ATP and test compound. Dose response curves were generated to determ...
In DepthDetails ArticlePubMed