BDBM57524 MLS000568816::N-[(2-thiophen-2-ylethanoylamino)carbamothioyl]benzamide::N-[N'-(2-Thiophen-2-yl-acetyl)-hydrazinocarbothioyl]-benzamide::N-[[(1-oxo-2-thiophen-2-ylethyl)hydrazo]-sulfanylidenemethyl]benzamide::N-[[(2-thiophen-2-ylacetyl)amino]carbamothioyl]benzamide::N-[[[2-(2-thienyl)acetyl]amino]thiocarbamoyl]benzamide::SMR000177005::cid_3132680
SMILES O=C(Cc1cccs1)NNC(=S)NC(=O)c1ccccc1
InChI Key InChIKey=MQXGTZFMBFROJT-UHFFFAOYSA-N
Data  1 IC50  1 EC50
  Tab Delimited (TSV)   2D SDfile   Computed 3D by Vconf -m prep SDfile
Find this compound or compounds like it in BindingDB:
Activity Spreadsheet -- Enzyme Inhibition Constant Data from BindingDB
Found 2 hits for monomerid = 57524
TargetStreptokinase A(Streptococcus pyogenes M1 GAS)
Broad Institute
Curated by PubChem BioAssay
LigandPNGBDBM57524(MLS000568816 | N-[(2-thiophen-2-ylethanoylamino)ca...)
Affinity DataEC50:  1.50E+5nM. Assay description: Keywords: Group A streptococcus, GAS, streptokinase, expression, virulence, inhibition, dose response, EC50 Assay Overview: The goal of this assa...
In DepthDetails PCBioAssay
TargetM17 leucyl aminopeptidase(Plasmodium falciparum 3D7)
Srmlsc
Curated by PubChem BioAssay
LigandPNGBDBM57524(MLS000568816 | N-[(2-thiophen-2-ylethanoylamino)ca...)
Affinity DataIC50:  3.00E+4nM. Assay description: Southern Research Molecular Libraries Screening Center (SRMLSC) Southern Research Institute (Birmingham, Alabama) NIH Molecular Libraries Screening...
In DepthDetails PCBioAssay