BDBM57569 (5E)-5-(3-bromobenzylidene)-2-[N'-(1,7,7-trimethylnorbornan-2-ylidene)hydrazino]-2-thiazolin-4-one::(5E)-5-[(3-bromophenyl)methylidene]-2-[2-(4,7,7-trimethyl-3-bicyclo[2.2.1]heptanylidene)hydrazinyl]-1,3-thiazol-4-one::(5E)-5-[(3-bromophenyl)methylidene]-2-[2-(4,7,7-trimethyl-3-bicyclo[2.2.1]heptanylidene)hydrazinyl]-4-thiazolone::5-[1-(3-Bromo-phenyl)-meth-(E)-ylidene]-2-{[1,7,7-trimethyl-bicyclo[2.2.1]hept-(2E)-ylidene]-hydrazono}-thiazolidin-4-one::MLS000589947::SMR000217198::cid_12005666
SMILES [H]C12CCC(C)(C(C1)=NNC1=NC(=O)C(S1)=Cc1cccc(Br)c1)C2(C)C
InChI Key InChIKey=XGBYPXJUPDRINW-UHFFFAOYSA-N
Data  1 EC50
  Tab Delimited (TSV)   2D SDfile   Computed 3D by Vconf -m prep SDfile
Find this compound or compounds like it in BindingDB:
Activity Spreadsheet -- Enzyme Inhibition Constant Data from BindingDB
Found 1 hit for monomerid = 57569
TargetStreptokinase A(Streptococcus pyogenes M1 GAS)
Broad Institute
Curated by PubChem BioAssay
LigandPNGBDBM57569((5E)-5-(3-bromobenzylidene)-2-[N'-(1,7,7-trimethyl...)
Affinity DataEC50:  1.50E+5nM. Assay description: Keywords: Group A streptococcus, GAS, streptokinase, expression, virulence, inhibition, dose response, EC50 Assay Overview: The goal of this assa...
In DepthDetails PCBioAssay