BDBM57894 (1E)-1-phenylethanone (4,6-diazepan-1-yl-1,3,5-triazin-2-yl)hydrazone::4,6-bis(1-azepanyl)-N-(1-phenylethylideneamino)-1,3,5-triazin-2-amine::4,6-bis(azepan-1-yl)-N-(1-phenylethylideneamino)-1,3,5-triazin-2-amine::MLS000720023::SMR000304552::[4,6-bis(azepan-1-yl)-s-triazin-2-yl]-(1-phenylethylideneamino)amine::cid_5026972
SMILES CC(N=Nc1nc(nc(n1)N1CCCCCC1)N1CCCCCC1)c1ccccc1
InChI Key InChIKey=JRLRBGFSZQGQGY-UHFFFAOYSA-N
Data  1 IC50  1 EC50
  Tab Delimited (TSV)   2D SDfile   Computed 3D by Vconf -m prep SDfile
Find this compound or compounds like it in BindingDB:
Activity Spreadsheet -- Enzyme Inhibition Constant Data from BindingDB
Found 2 hits for monomerid = 57894
TargetPotassium voltage-gated channel subfamily KQT member 2(Rattus norvegicus)
Johns Hopkins Ion Channel Center
Curated by PubChem BioAssay
LigandPNGBDBM57894((1E)-1-phenylethanone (4,6-diazepan-1-yl-1,3,5-tri...)
Affinity DataIC50:  1.62E+3nM. Assay description: Source (MLPCN Center Name): Johns Hopkins Ion Channel Center (JHICC_KCNQ2_Inh_HFCP_IWS_CRC) Center Affiliation: Johns Hopkins University, School of M...
In DepthDetails PCBioAssay
TargetStreptokinase A(Streptococcus pyogenes M1 GAS)
Broad Institute
Curated by PubChem BioAssay
LigandPNGBDBM57894((1E)-1-phenylethanone (4,6-diazepan-1-yl-1,3,5-tri...)
Affinity DataEC50:  5.50E+3nM. Assay description: Keywords: Group A streptococcus, GAS, streptokinase, expression, virulence, inhibition, dose response, EC50 Assay Overview: The goal of this assa...
In DepthDetails PCBioAssay