BDBM57998 (4Z)-2-(4-methoxyphenyl)-4-[(2-methyl-1H-indol-3-yl)methylene]-2-oxazolin-5-one::(4Z)-2-(4-methoxyphenyl)-4-[(2-methyl-1H-indol-3-yl)methylidene]-1,3-oxazol-5-one::(4Z)-2-(4-methoxyphenyl)-4-[(2-methyl-1H-indol-3-yl)methylidene]-5-oxazolone::MLS000759677::SMR000369398::cid_5673818
SMILES COc1ccc(cc1)C1=N\C(=C/c2c(C)[nH]c3ccccc23)C(=O)O1
InChI Key InChIKey=OFRYANCZSXKOOF-WQRHYEAKSA-N
Data  2 EC50
  Tab Delimited (TSV)   2D SDfile   Computed 3D by Vconf -m prep SDfile
Find this compound or compounds like it in BindingDB:
Activity Spreadsheet -- Enzyme Inhibition Constant Data from BindingDB
Found 2 hits for monomerid = 57998
TargetImportin subunit alpha-1(Homo sapiens (Human))
Broad Institute
Curated by PubChem BioAssay
LigandPNGBDBM57998((4Z)-2-(4-methoxyphenyl)-4-[(2-methyl-1H-indol-3-y...)
Affinity DataEC50: >5.00E+5nM. Assay description: Keywords: Counterscreen, FRET assay, HTS, YIC probe, Dose response, Assay Overview: This is a fluorescence resonance energy transfer (FRET)-based b...
In DepthDetails PCBioAssay
TargetStreptokinase A(Streptococcus pyogenes M1 GAS)
Broad Institute
Curated by PubChem BioAssay
LigandPNGBDBM57998((4Z)-2-(4-methoxyphenyl)-4-[(2-methyl-1H-indol-3-y...)
Affinity DataEC50:  1.50E+5nM. Assay description: Keywords: Group A streptococcus, GAS, streptokinase, expression, virulence, inhibition, dose response, EC50 Assay Overview: The goal of this assa...
In DepthDetails PCBioAssay