BDBM58085 1-(4-Isopropyl-benzoyl)-3-(2-oxo-2,3-dihydro-1H-benzoimidazol-5-yl)-thiourea::4-isopropyl-N-[(2-keto-1,3-dihydrobenzimidazol-5-yl)thiocarbamoyl]benzamide::MLS000806967::N-[(2-oxidanylidene-1,3-dihydrobenzimidazol-5-yl)carbamothioyl]-4-propan-2-yl-benzamide::N-[(2-oxo-1,3-dihydrobenzimidazol-5-yl)carbamothioyl]-4-propan-2-ylbenzamide::N-[[(2-oxo-1,3-dihydrobenzimidazol-5-yl)amino]-sulfanylidenemethyl]-4-propan-2-ylbenzamide::SMR000414796::cid_1493694
SMILES CC(C)c1ccc(cc1)C(=O)NC(=S)Nc1ccc2[nH]c(=O)[nH]c2c1
InChI Key InChIKey=PVWKZXWWENBMOE-UHFFFAOYSA-N
Data  1 EC50
  Tab Delimited (TSV)   2D SDfile   Computed 3D by Vconf -m prep SDfile
Find this compound or compounds like it in BindingDB:
Activity Spreadsheet -- Enzyme Inhibition Constant Data from BindingDB
Found 1 hit for monomerid = 58085
TargetStreptokinase A(Streptococcus pyogenes M1 GAS)
Broad Institute
Curated by PubChem BioAssay
LigandPNGBDBM58085(1-(4-Isopropyl-benzoyl)-3-(2-oxo-2,3-dihydro-1H-be...)
Affinity DataEC50:  1.50E+5nM. Assay description: Keywords: Group A streptococcus, GAS, streptokinase, expression, virulence, inhibition, dose response, EC50 Assay Overview: The goal of this assa...
In DepthDetails PCBioAssay