BDBM58553 5-chloranyl-N-(3,4-dimethylphenyl)-2-[(2-methylphenyl)methylsulfonyl]pyrimidine-4-carboxamide::5-chloro-N-(3,4-dimethylphenyl)-2-(2-methylbenzyl)sulfonyl-pyrimidine-4-carboxamide::5-chloro-N-(3,4-dimethylphenyl)-2-[(2-methylphenyl)methylsulfonyl]-4-pyrimidinecarboxamide::5-chloro-N-(3,4-dimethylphenyl)-2-[(2-methylphenyl)methylsulfonyl]pyrimidine-4-carboxamide::MLS001116158::SMR000625790::cid_16452952
SMILES Cc1ccc(NC(=O)c2nc(ncc2Cl)S(=O)(=O)Cc2ccccc2C)cc1C
InChI Key InChIKey=IXFUGWXLNKEHKO-UHFFFAOYSA-N
Data  2 IC50  1 EC50
  Tab Delimited (TSV)   2D SDfile   Computed 3D by Vconf -m prep SDfile
Find this compound or compounds like it in BindingDB:
Activity Spreadsheet -- Enzyme Inhibition Constant Data from BindingDB
Found 3 hits for monomerid = 58553
TargetStreptokinase A(Streptococcus pyogenes M1 GAS)
Broad Institute
Curated by PubChem BioAssay
LigandPNGBDBM58553(5-chloranyl-N-(3,4-dimethylphenyl)-2-[(2-methylphe...)
Affinity DataEC50:  1.32E+3nM. Assay description: Keywords: Group A streptococcus, GAS, streptokinase, expression, virulence, inhibition, dose response, EC50 Assay Overview: The goal of this assa...
In DepthDetails PCBioAssay
TargetBeta-lactamase(Pseudomonas aeruginosa)
The Scripps Research Institute Molecular Screening Center
Curated by PubChem BioAssay
LigandPNGBDBM58553(5-chloranyl-N-(3,4-dimethylphenyl)-2-[(2-methylphe...)
Affinity DataIC50:  1.15E+4nM. Assay description: Source (MLPCN Center Name): The Scripps Research Institute Molecular Screening Center (SRIMSC) Affiliation: The Scripps Research Institute, TSRI Assa...
In DepthDetails PCBioAssay
TargetToll-like receptor 9(Homo sapiens (Human))
The Scripps Research Institute Molecular Screening Center
Curated by PubChem BioAssay
LigandPNGBDBM58553(5-chloranyl-N-(3,4-dimethylphenyl)-2-[(2-methylphe...)
Affinity DataIC50:  1.23E+4nM. Assay description: Source (MLPCN Center Name): The Scripps Research Institute Molecular Screening Center (SRIMSC) Affiliation: The Scripps Research Institute, TSRI Assa...
In DepthDetails PCBioAssay