BDBM58945 IK-IK::MLS002153618::SMR001230886::cid_24978565
SMILES CC[C@H](C)Cc1cn(nn1)[C@@H](CCCCN)C(=O)NCCCCCCCCCCC(=O)N1CCN(CC1)c1nc(NCCOCCOCCOCC#C)nc(n1)N1CCN(CC1)C(=O)CCCCCCCCCCNC(=O)[C@H](CCCCN)n1cc(C[C@@H](C)CC)nn1
InChI Key InChIKey=UIZOYKBALIHNJF-MODPYIGGSA-N
Data  4 IC50  1 EC50
  Tab Delimited (TSV)   2D SDfile   Computed 3D by Vconf -m prep SDfile
Find this compound or compounds like it in BindingDB:
Activity Spreadsheet -- Enzyme Inhibition Constant Data from BindingDB
Found 5 hits for monomerid = 58945
TargetStreptokinase A(Streptococcus pyogenes M1 GAS)
Broad Institute
Curated by PubChem BioAssay
LigandPNGBDBM58945(IK-IK | MLS002153618 | SMR001230886 | cid_24978565)
Affinity DataEC50:  1.39E+4nM. Assay description: Keywords: Group A streptococcus, GAS, streptokinase, expression, virulence, inhibition, dose response, EC50 Assay Overview: The goal of this assa...
In DepthDetails PCBioAssay
TargetToll-like receptor 9(Homo sapiens (Human))
The Scripps Research Institute Molecular Screening Center
Curated by PubChem BioAssay
LigandPNGBDBM58945(IK-IK | MLS002153618 | SMR001230886 | cid_24978565)
Affinity DataIC50:  6.59E+3nM. Assay description: Source (MLPCN Center Name): The Scripps Research Institute Molecular Screening Center (SRIMSC) Affiliation: The Scripps Research Institute, TSRI Assa...
In DepthDetails PCBioAssay
Target26S proteasome non-ATPase regulatory subunit 14(Homo sapiens (Human))
Burnham Center For Chemical Genomics
Curated by PubChem BioAssay
LigandPNGBDBM58945(IK-IK | MLS002153618 | SMR001230886 | cid_24978565)
Affinity DataIC50:  1.62E+4nM. Assay description: Data Source: Sanford-Burnham Center for Chemical Genomics (SBCCG) Source Affiliation: Sanford Burnham Medical Research Institute (SBMRI, La Jolla, CA...
In DepthDetails PCBioAssay
TargetProthrombin(Bos taurus (Bovine))
Burnham Center For Chemical Genomics
Curated by PubChem BioAssay
LigandPNGBDBM58945(IK-IK | MLS002153618 | SMR001230886 | cid_24978565)
Affinity DataIC50:  2.45E+4nM. Assay description: Data Source: Sanford-Burnham Center for Chemical Genomics (SBCCG) Source Affiliation: Sanford Burnham Medical Research Institute (SBMRI, La Jolla, CA...
In DepthDetails PCBioAssay
TargetBeta-lactamase(Pseudomonas aeruginosa)
The Scripps Research Institute Molecular Screening Center
Curated by PubChem BioAssay
LigandPNGBDBM58945(IK-IK | MLS002153618 | SMR001230886 | cid_24978565)
Affinity DataIC50:  7.10E+3nM. Assay description: Source (MLPCN Center Name): The Scripps Research Institute Molecular Screening Center (SRIMSC) Affiliation: The Scripps Research Institute, TSRI Assa...
In DepthDetails PCBioAssay