BDBM58952 MLS000055080::N-(4-chloranyl-2-methoxy-phenyl)-2-[2-[4-(4-hydroxyphenyl)piperazin-1-yl]carbonylphenoxy]ethanamide::N-(4-chloro-2-methoxy-phenyl)-2-[2-[4-(4-hydroxyphenyl)piperazine-1-carbonyl]phenoxy]acetamide::N-(4-chloro-2-methoxyphenyl)-2-[2-[4-(4-hydroxyphenyl)piperazine-1-carbonyl]phenoxy]acetamide::N-(4-chloro-2-methoxyphenyl)-2-[2-[[4-(4-hydroxyphenyl)-1-piperazinyl]-oxomethyl]phenoxy]acetamide::SMR000066713::cid_2997837
SMILES COc1cc(Cl)ccc1NC(=O)COc1ccccc1C(=O)N1CCN(CC1)c1ccc(O)cc1
InChI Key InChIKey=QHCULGKRZGLOSG-UHFFFAOYSA-N
Data  1 IC50  1 EC50
  Tab Delimited (TSV)   2D SDfile   Computed 3D by Vconf -m prep SDfile
Find this compound or compounds like it in BindingDB:
Activity Spreadsheet -- Enzyme Inhibition Constant Data from BindingDB
Found 2 hits for monomerid = 58952
TargetLarge T antigen(Simian virus 40)
Southern Research Specialized Biocontainment Screening Center
Curated by PubChem BioAssay
LigandPNGBDBM58952(MLS000055080 | N-(4-chloranyl-2-methoxy-phenyl)-2-...)
Affinity DataEC50:  3.37E+4nM. Assay description: Southern Research's Specialized Biocontainment Screening Center (SRSBSC) Southern Research Institute (Birmingham, Alabama) NIH Molecular Librarie...
In DepthDetails PCBioAssay
TargetLarge T antigen(Simian virus 40)
Southern Research Specialized Biocontainment Screening Center
Curated by PubChem BioAssay
LigandPNGBDBM58952(MLS000055080 | N-(4-chloranyl-2-methoxy-phenyl)-2-...)
Affinity DataIC50:  1.34E+4nM. Assay description: A biochemical assay using the ADP-Hunter methodology, purified TAg, and ATP to identify compounds that inhibit the ATPase activity of Tag Southern Re...
In DepthDetails PCBioAssay