BDBM59019 4-(4-hydroxyphenyl)-N-(4-morpholin-4-ylsulfonylphenyl)piperazine-1-carbothioamide::4-(4-hydroxyphenyl)-N-(4-morpholinosulfonylphenyl)piperazine-1-carbothioamide::4-(4-hydroxyphenyl)-N-[4-(4-morpholinylsulfonyl)phenyl]-1-piperazinecarbothioamide::MLS000761338::SMR000370246::cid_3937050
SMILES Oc1ccc(cc1)N1CCN(CC1)C(=S)Nc1ccc(cc1)S(=O)(=O)N1CCOCC1
InChI Key InChIKey=XFYHKRSAJRBIBU-UHFFFAOYSA-N
Data  1 EC50
  Tab Delimited (TSV)   2D SDfile   Computed 3D by Vconf -m prep SDfile
Find this compound or compounds like it in BindingDB:
Activity Spreadsheet -- Enzyme Inhibition Constant Data from BindingDB
Found 1 hit for monomerid = 59019
TargetLarge T antigen(Simian virus 40)
Southern Research Specialized Biocontainment Screening Center
Curated by PubChem BioAssay
LigandPNGBDBM59019(4-(4-hydroxyphenyl)-N-(4-morpholin-4-ylsulfonylphe...)
Affinity DataEC50:  3.30E+4nM. Assay description: Southern Research's Specialized Biocontainment Screening Center (SRSBSC) Southern Research Institute (Birmingham, Alabama) NIH Molecular Librarie...
In DepthDetails PCBioAssay