BDBM5910 3-[3-chloro-4-(1-oxo-2,3-dihydro-1H-isoindol-4-yl)phenyl]-1-(3-methylphenyl)urea::CHEMBL185614::isoindolinone analog 10g
SMILES Cc1cccc(NC(=O)Nc2ccc(c(Cl)c2)-c2cccc3C(=O)NCc23)c1
InChI Key InChIKey=OLTBLEXDHJLGOW-UHFFFAOYSA-N
Data  1 IC50
  Tab Delimited (TSV)   2D SDfile   Computed 3D by Vconf -m prep SDfile
Find this compound or compounds like it in BindingDB:
Activity Spreadsheet -- Enzyme Inhibition Constant Data from BindingDB
Found 1 hit for monomerid = 5910
TargetVascular endothelial growth factor receptor 2(Homo sapiens (Human))
Abbott Laboratories
LigandPNGBDBM5910(3-[3-chloro-4-(1-oxo-2,3-dihydro-1H-isoindol-4-yl)...)
Affinity DataIC50:  71nMpH: 7.4 T: 2°C. Assay description: The assay was using baculovirus-expressed recombinant protein kinase and biotinylated poly-Glu-Ala-Tyr substrate. HTRF is based on the proximity of a...
In DepthDetails ArticlePubMed