BDBM59148 Hymenialdisine, 28z
SMILES Fc1ccc2[nH]c3c(C(CCNC3=O)=NNc3cccnc3Cl)c2c1
InChI Key InChIKey=TVKHEKZVCHMORX-UHFFFAOYSA-N
Data  3 IC50
  Tab Delimited (TSV)   2D SDfile   Computed 3D by Vconf -m prep SDfile
Find this compound or compounds like it in BindingDB:
Activity Spreadsheet -- Enzyme Inhibition Constant Data from BindingDB
Found 3 hits for monomerid = 59148
TargetCyclin-dependent kinase 5 activator 1(Homo sapiens (Human))
Genomics Institute Of The Novartis Research Foundation
LigandPNGBDBM59148(Hymenialdisine, 28z)
Affinity DataIC50:  12nMpH: 7.2Assay Description:In vitro kinase assay using SPA assay kit from Amersham Pharmacia Biotech, Uk.
In DepthDetails ArticlePubMed
TargetCyclin-dependent kinase 1(Homo sapiens (Human))
Genomics Institute Of The Novartis Research Foundation
LigandPNGBDBM59148(Hymenialdisine, 28z)
Affinity DataIC50:  400nMpH: 7.2Assay Description:In vitro kinase assay using SPA assay kit from Amersham Pharmacia Biotech, Uk.
In DepthDetails ArticlePubMed
TargetGlycogen synthase kinase-3 beta(Homo sapiens (Human))
Genomics Institute Of The Novartis Research Foundation
LigandPNGBDBM59148(Hymenialdisine, 28z)
Affinity DataIC50:  88nMpH: 7.2Assay Description:In vitro kinase assay using SPA assay kit from Amersham Pharmacia Biotech, Uk.
In DepthDetails ArticlePubMed