BDBM59247 Benzotriazole ester, 15
SMILES Nc1ccc(cc1)C(=O)Cn1nnc2ccccc12
InChI Key InChIKey=PPIIXUVTRPOFDW-UHFFFAOYSA-N
Data  1 IC50
  Tab Delimited (TSV)   2D SDfile   Computed 3D by Vconf -m prep SDfile
Find this compound or compounds like it in BindingDB:
Activity Spreadsheet -- Enzyme Inhibition Constant Data from BindingDB
Found 1 hit for monomerid = 59247
TargetReplicase polyprotein 1ab(Human SARS coronavirus (SARS-CoV) (Severe acute re...)
Academia Sinica
LigandPNGBDBM59247(Benzotriazole ester, 15)
Affinity DataIC50: >5.00E+4nMpH: 7.5Assay Description:Inhibition assay against SARS-CoV 3CL protease, a fluorometric assay was utilized to determine the inhibition constants of the samples.
In DepthDetails ArticlePubMed