BDBM59262 MLS000085838::N-(1-{[(2,6-dimethylphenyl)amino]carbonyl}cyclohexyl)-N-(3-methoxyphenyl)-1H-pyrazole-3-carboxamide::N-[1-[(2,6-dimethylanilino)-oxomethyl]cyclohexyl]-N-(3-methoxyphenyl)-1H-pyrazole-5-carboxamide::N-[1-[(2,6-dimethylphenyl)carbamoyl]cyclohexyl]-N-(3-methoxyphenyl)-1H-pyrazole-5-carboxamide::SMR000021167::cid_1205217
SMILES COc1cccc(c1)N(C(=O)c1ccn[nH]1)C1(CCCCC1)C(=O)Nc1c(C)cccc1C
InChI Key InChIKey=RVVNVPIBGYMNNV-UHFFFAOYSA-N
Data  2 EC50
  Tab Delimited (TSV)   2D SDfile   Computed 3D by Vconf -m prep SDfile
Find this compound or compounds like it in BindingDB:
Activity Spreadsheet -- Enzyme Inhibition Constant Data from BindingDB
Found 2 hits for monomerid = 59262
TargetProtein LANA1(Human herpesvirus 8)
Broad Institute
Curated by PubChem BioAssay
LigandPNGBDBM59262(MLS000085838 | N-(1-{[(2,6-dimethylphenyl)amino]ca...)
Affinity DataEC50: >7.50E+4nM. Assay description: Primary Collaborators: Kenneth Kaye,Brigham & Womens,Boston MA,kkaye@rics.bwh.harvard.edu,617-525-4256 Chantal Beauchemin,Brigham & Womens,Boston MA,...
In DepthDetails PCBioAssay
TargetAlkaline phosphatase, tissue-nonspecific isozyme(Homo sapiens (Human))
Sanford-Burnham Center For Chemical Genomics
Curated by PubChem BioAssay
LigandPNGBDBM59262(MLS000085838 | N-(1-{[(2,6-dimethylphenyl)amino]ca...)
Affinity DataEC50:  5.29E+4nM. Assay description: Data Source: Sanford-Burnham Center for Chemical Genomics (SBCCG) Source Affiliation: Sanford-Burnham Medical Research Institute (SBMRI, San Diego, C...
In DepthDetails PCBioAssay