BDBM5935 BMS-387032 analog 25::N-[5-[[[5-(1,1-Dimethylethyl)-2-oxazolyl]methyl]thio]-2-thiazolyl]-(N-tert-butoxycarbonyl)-4-piperidinecarboxamide::tert-butyl 4-[(5-{[(5-tert-butyl-1,3-oxazol-2-yl)methyl]sulfanyl}-1,3-thiazol-2-yl)carbamoyl]piperidine-1-carboxylate
SMILES CC(C)(C)OC(=O)N1CCC(CC1)C(=O)Nc1ncc(SCc2ncc(o2)C(C)(C)C)s1
InChI Key InChIKey=DJKHLSSMJRYOLA-UHFFFAOYSA-N
Data  1 IC50
  Tab Delimited (TSV)   2D SDfile   Computed 3D by Vconf -m prep SDfile
Find this compound or compounds like it in BindingDB:
Activity Spreadsheet -- Enzyme Inhibition Constant Data from BindingDB
Found 1 hit for monomerid = 5935
TargetCyclin-dependent kinase 2/G1/S-specific cyclin-E1(Homo sapiens (Human))
Bristol-Myers Squibb
LigandPNGBDBM5935(BMS-387032 analog 25 | N-[5-[[[5-(1,1-Dimethylethy...)
Affinity DataIC50:  160nMpH: 8.0 T: 2°C. Assay description:  The enzyme was assayed with substrate in the presence of 25 uM ATP/[gamma-33P] ATP and test compound. Dose response curves were generated to determ...
In DepthDetails ArticlePubMed