BDBM59393 4-(5-bromanylfuran-2-yl)carbonyl-7-methyl-5-phenyl-3,5-dihydro-1H-1,4-benzodiazepin-2-one::4-(5-bromo-2-furoyl)-7-methyl-5-phenyl-3,5-dihydro-1H-1,4-benzodiazepin-2-one::4-(5-bromofuran-2-carbonyl)-7-methyl-5-phenyl-3,5-dihydro-1H-1,4-benzodiazepin-2-one::4-[(5-bromo-2-furanyl)-oxomethyl]-7-methyl-5-phenyl-3,5-dihydro-1H-1,4-benzodiazepin-2-one::MLS000104025::SMR000015906::cid_3290432
SMILES Cc1ccc2NC(=O)CN(C(c3ccccc3)c2c1)C(=O)c1ccc(Br)o1
InChI Key InChIKey=QVKYNUOKDZUYJM-UHFFFAOYSA-N
Data  1 IC50
  Tab Delimited (TSV)   2D SDfile   Computed 3D by Vconf -m prep SDfile
Find this compound or compounds like it in BindingDB:
Activity Spreadsheet -- Enzyme Inhibition Constant Data from BindingDB
Found 1 hit for monomerid = 59393
TargetE3 ubiquitin-protein ligase XIAP(Homo sapiens (Human))
Sanford-Burnham Center For Chemical Genomics
Curated by PubChem BioAssay
LigandPNGBDBM59393(4-(5-bromanylfuran-2-yl)carbonyl-7-methyl-5-phenyl...)
Affinity DataIC50:  1.00E+5nM. Assay description: Data Source: Sanford-Burnham Center for Chemical Genomics (SBCCG) Source Affiliation: Sanford-Burnham Medical Research Institute (SBMRI, San Diego, C...
In DepthDetails PCBioAssay