BDBM59455 3-(3-methylphenyl)-2-sulfanylidene-1H-[1]benzofuro[3,2-d]pyrimidin-4-one::3-(3-methylphenyl)-2-sulfanylidene-1H-benzofuro[3,2-d]pyrimidin-4-one::3-(m-tolyl)-2-thioxo-1H-benzofuro[3,2-d]pyrimidin-4-one::MLS000418872::SMR000236841::cid_7120053
SMILES Cc1cccc(c1)-n1c(=S)[nH]c2c3ccccc3oc2c1=O
InChI Key InChIKey=STBCNNBWHZGPPB-UHFFFAOYSA-N
Data  3 IC50
  Tab Delimited (TSV)   2D SDfile   Computed 3D by Vconf -m prep SDfile
Find this compound or compounds like it in BindingDB:
Activity Spreadsheet -- Enzyme Inhibition Constant Data from BindingDB
Found 3 hits for monomerid = 59455
TargetE3 ubiquitin-protein ligase XIAP(Homo sapiens (Human))
Sanford-Burnham Center For Chemical Genomics
Curated by PubChem BioAssay
LigandPNGBDBM59455(3-(3-methylphenyl)-2-sulfanylidene-1H-[1]benzofuro...)
Affinity DataIC50:  1.00E+5nM. Assay description: Data Source: Sanford-Burnham Center for Chemical Genomics (SBCCG) Source Affiliation: Sanford-Burnham Medical Research Institute (SBMRI, San Diego, C...
In DepthDetails PCBioAssay
TargetIsoform 2 of Nuclear receptor corepressor 2 (TRAC-1)(Homo sapiens (Human))
The Scripps Research Institute Molecular Screening Center
Curated by PubChem BioAssay
LigandPNGBDBM59455(3-(3-methylphenyl)-2-sulfanylidene-1H-[1]benzofuro...)
Affinity DataIC50:  6.64E+3nM. Assay description: Source (MLPCN Center Name): The Scripps Research Institute Molecular Screening Center Affiliation: The Scripps Research Institute, TSRI Assay Provide...
In DepthDetails PCBioAssay
TargetPhotoreceptor-specific nuclear receptor(Homo sapiens (Human))
The Scripps Research Institute Molecular Screening Center
Curated by PubChem BioAssay
LigandPNGBDBM59455(3-(3-methylphenyl)-2-sulfanylidene-1H-[1]benzofuro...)
Affinity DataIC50:  5.11E+3nM. Assay description: Source (MLPCN Center Name): The Scripps Research Institute Molecular Screening Center Affiliation: The Scripps Research Institute, TSRI Assay Provide...
In DepthDetails PCBioAssay