BDBM5966 3-Benzyl-6-methyl-1-(2,4,6-trichlorophenyl)-4,5-dihydro-1H-pyrazolo[3,4-d]pyrimidin-4-one::3-benzyl-6-methyl-1-(2,4,6-trichlorophenyl)-1H,4H,5H-pyrazolo[3,4-d]pyrimidin-4-one::pyrazolo[3,4-d]pyrimidin-4-one deriv. 10f
SMILES Cc1nc2n(nc(Cc3ccccc3)c2c(=O)[nH]1)-c1c(Cl)cc(Cl)cc1Cl
InChI Key InChIKey=FWZBCYRRGBYKGI-UHFFFAOYSA-N
Data  1 IC50
  Tab Delimited (TSV)   2D SDfile   Computed 3D by Vconf -m prep SDfile
Find this compound or compounds like it in BindingDB:
Activity Spreadsheet -- Enzyme Inhibition Constant Data from BindingDB
Found 1 hit for monomerid = 5966
TargetCyclin-dependent kinase 4/G1/S-specific cyclin-D1(Homo sapiens (Human))
Bristol-Myers Squibb
LigandPNGBDBM5966(3-Benzyl-6-methyl-1-(2,4,6-trichlorophenyl)-4,5-di...)
Affinity DataIC50: >4.80E+4nM. Assay description: The enzyme was assayed with substrate GST-Rb in the presence of 50 uM ATP/[gamma-32P] ATP, and capturing the 32-P labeled reaction products on GSH-Se...
In DepthDetails ArticlePubMed