BDBM59855 6-(2,3-dihydro-1,4-benzodioxin-6-ylcarbamoylamino)hexanoic acid::6-[3-(2,3-Dihydro-benzo[1,4]dioxin-6-yl)-ureido]-hexanoic acid::6-[[(2,3-dihydro-1,4-benzodioxin-6-ylamino)-oxomethyl]amino]hexanoic acid::MLS000551585::SMR000145510::cid_4360734
SMILES OC(=O)CCCCCNC(=O)Nc1ccc2OCCOc2c1
InChI Key InChIKey=ALLDSSCVVDYGHF-UHFFFAOYSA-N
Data  2 IC50
  Tab Delimited (TSV)   2D SDfile   Computed 3D by Vconf -m prep SDfile
Find this compound or compounds like it in BindingDB:
Activity Spreadsheet -- Enzyme Inhibition Constant Data from BindingDB
Found 2 hits for monomerid = 59855
TargetProcathepsin L(Homo sapiens (Human))
The Scripps Research Institute Molecular Screening Center
Curated by PubChem BioAssay
LigandPNGBDBM59855(6-(2,3-dihydro-1,4-benzodioxin-6-ylcarbamoylamino)...)
Affinity DataIC50: >5.96E+4nM. Assay description: Source (MLPCN Center Name): The Scripps Research Institute Molecular Screening Center Affiliation: The Scripps Research Institute, TSRI Assay Provide...
In DepthDetails PCBioAssay
TargetM17 leucyl aminopeptidase(Plasmodium falciparum 3D7)
Srmlsc
Curated by PubChem BioAssay
LigandPNGBDBM59855(6-(2,3-dihydro-1,4-benzodioxin-6-ylcarbamoylamino)...)
Affinity DataIC50:  5.51E+3nM. Assay description: Southern Research Molecular Libraries Screening Center (SRMLSC) Southern Research Institute (Birmingham, Alabama) NIH Molecular Libraries Screening...
In DepthDetails PCBioAssay