BDBM6 CHEMBL18850::cyclohexanone
SMILES O=C1CCCCC1
InChI Key InChIKey=JHIVVAPYMSGYDF-UHFFFAOYSA-N
Data  1 IC50  2 ITC
PDB links: 6 PDB IDs match this monomer.
  Tab Delimited (TSV)   2D SDfile   Computed 3D by Vconf -m prep SDfile
Find this compound or compounds like it in BindingDB:
Activity Spreadsheet -- Enzyme Inhibition Constant Data from BindingDB
Found 1 hit for monomerid = 6
TargetPhenylethanolamine N-methyltransferase(Bos taurus (bovine))
TBA
Curated by ChEMBL
LigandPNGBDBM6(CHEMBL18850 | cyclohexanone)
Affinity DataIC50: >1.00E+6nM. Assay description: Inhibitory activity against phenylethanolamine N-methyltransferase
In DepthDetails ArticlePubMed
Activity Spreadsheet -- ITC Data from BindingDB
Found 2 hits for monomerid = 6
HostPNGBDBM4((1S,3R,5R,6S,8R,10R,11S,13R,15R,16S,18R,20R,21S,23...)
National Institute Of Standards And Technology
GuestPNGBDBM6(CHEMBL18850 | cyclohexanone)
ITC DataΔG°: -1.84kcal/mole −TΔS°: 0.855kcal/mole ΔH°: -2.65kcal/mole logk: 22
pH: 6.9 T: 25.00°C
In DepthDetails
HostPNGBDBM11(beta-cyclodextrin | betadex)
National Institute Of Standards And Technology
GuestPNGBDBM6(CHEMBL18850 | cyclohexanone)
ITC DataΔG°: -3.70kcal/mole −TΔS°: -0.926kcal/mole ΔH°: -2.79kcal/mole logk: 510
pH: 6.9 T: 25.00°C
In DepthDetails