BDBM60043 2-keto-1H-pyridine-3-carboxylic acid [2-(2,5-dimethyl-1-propyl-pyrrol-3-yl)-2-keto-ethyl] ester::2-oxo-1H-pyridine-3-carboxylic acid [2-(2,5-dimethyl-1-propyl-3-pyrrolyl)-2-oxoethyl] ester::MLS000416851::SMR000241834::[2-(2,5-dimethyl-1-propyl-pyrrol-3-yl)-2-oxidanylidene-ethyl] 2-oxidanylidene-1H-pyridine-3-carboxylate::[2-(2,5-dimethyl-1-propylpyrrol-3-yl)-2-oxoethyl] 2-oxo-1H-pyridine-3-carboxylate::cid_2522066
SMILES CCCn1c(C)cc(C(=O)COC(=O)c2ccc[nH]c2=O)c1C
InChI Key InChIKey=PFOFUWYTBQFUGI-UHFFFAOYSA-N
Data  1 IC50  2 EC50
  Tab Delimited (TSV)   2D SDfile   Computed 3D by Vconf -m prep SDfile
Find this compound or compounds like it in BindingDB:
Activity Spreadsheet -- Enzyme Inhibition Constant Data from BindingDB
Found 3 hits for monomerid = 60043
TargetM17 leucyl aminopeptidase(Plasmodium falciparum 3D7)
Srmlsc
Curated by PubChem BioAssay
LigandPNGBDBM60043(2-keto-1H-pyridine-3-carboxylic acid [2-(2,5-dimet...)
Affinity DataIC50:  1.53E+4nM. Assay description: Southern Research Molecular Libraries Screening Center (SRMLSC) Southern Research Institute (Birmingham, Alabama) NIH Molecular Libraries Screening...
In DepthDetails PCBioAssay
TargetTumor necrosis factor receptor superfamily member 10B(Homo sapiens (Human))
Burnham Center For Chemical Genomics
Curated by PubChem BioAssay
LigandPNGBDBM60043(2-keto-1H-pyridine-3-carboxylic acid [2-(2,5-dimet...)
Affinity DataEC50: >1.25E+4nM
In DepthDetails PCBioAssay
TargetHeat shock factor protein 1(Mus musculus)
Broad Institute
Curated by PubChem BioAssay
LigandPNGBDBM60043(2-keto-1H-pyridine-3-carboxylic acid [2-(2,5-dimet...)
Affinity DataEC50:  289nM. Assay description: Keywords: Heat Shock Factor-1 (HSF-1), Stress Response, MG132, NIH3T3, Luminescence Assay Overview: Modified NIH3T3, transformed to express firefly...
In DepthDetails PCBioAssay