BDBM6013 3-Ethyl-6-(4-hydroxybenzyl)-1-(2,4,6-trichlorophenyl)-4,5-dihydro-1H-pyrazolo[3,4-d]pyrimidin-4-one::3-ethyl-6-[(4-hydroxyphenyl)methyl]-1-(2,4,6-trichlorophenyl)-1H,4H,5H-pyrazolo[3,4-d]pyrimidin-4-one::pyrazolo[3,4-d]pyrimidin-4-one deriv. 19m
SMILES CCc1nn(-c2c(Cl)cc(Cl)cc2Cl)c2nc(Cc3ccc(O)cc3)[nH]c(=O)c12
InChI Key InChIKey=BSDJIQDLIJZWHF-UHFFFAOYSA-N
Data  3 IC50
  Tab Delimited (TSV)   2D SDfile   Computed 3D by Vconf -m prep SDfile
Find this compound or compounds like it in BindingDB:
Activity Spreadsheet -- Enzyme Inhibition Constant Data from BindingDB
Found 3 hits for monomerid = 6013
TargetCyclin-dependent kinase 4/G1/S-specific cyclin-D1(Homo sapiens (Human))
Bristol-Myers Squibb
LigandPNGBDBM6013(3-Ethyl-6-(4-hydroxybenzyl)-1-(2,4,6-trichlorophen...)
Affinity DataIC50:  2.00E+3nM. Assay description: The enzyme was assayed with substrate GST-Rb in the presence of 50 uM ATP/[gamma-32P] ATP, and capturing the 32-P labeled reaction products on GSH-Se...
In DepthDetails ArticlePubMed
TargetCyclin-dependent kinase/G2/mitotic-specific cyclin- 1(Homo sapiens (Human))
Bristol-Myers Squibb
LigandPNGBDBM6013(3-Ethyl-6-(4-hydroxybenzyl)-1-(2,4,6-trichlorophen...)
Affinity DataIC50:  100nM. Assay description: The enzyme was assayed with substrate GST-Rb in the presence of 50 uM ATP/[gamma-32P] ATP, and capturing the 32-P labeled reaction products on GSH-Se...
In DepthDetails ArticlePubMed
TargetCyclin-dependent kinase 2/G1/S-specific cyclin-E1(Homo sapiens (Human))
Bristol-Myers Squibb
LigandPNGBDBM6013(3-Ethyl-6-(4-hydroxybenzyl)-1-(2,4,6-trichlorophen...)
Affinity DataIC50:  16nM. Assay description: The enzyme was assayed with substrate GST-Rb in the presence of 50 uM ATP/[gamma-32P] ATP, and capturing the 32-P labeled reaction products on GSH-Se...
In DepthDetails ArticlePubMed