BDBM6017 3-Ethyl-6-(3-methoxy-4-methylbenzyl)-1-(2,4,6-trichlorophenyl)-4,5-dihydro-1H-pyrazolo[3,4-d]pyrimidin-4-one::3-ethyl-6-[(3-methoxy-4-methylphenyl)methyl]-1-(2,4,6-trichlorophenyl)-1H,4H,5H-pyrazolo[3,4-d]pyrimidin-4-one::pyrazolo[3,4-d]pyrimidin-4-one deriv. 19q
SMILES CCc1nn(-c2c(Cl)cc(Cl)cc2Cl)c2nc(Cc3ccc(C)c(OC)c3)[nH]c(=O)c12
InChI Key InChIKey=CMBQTTRYXSWQAN-UHFFFAOYSA-N
Data  2 IC50
  Tab Delimited (TSV)   2D SDfile   Computed 3D by Vconf -m prep SDfile
Find this compound or compounds like it in BindingDB:
Activity Spreadsheet -- Enzyme Inhibition Constant Data from BindingDB
Found 2 hits for monomerid = 6017
TargetCyclin-dependent kinase 2/G1/S-specific cyclin-E1(Homo sapiens (Human))
Bristol-Myers Squibb
LigandPNGBDBM6017(3-Ethyl-6-(3-methoxy-4-methylbenzyl)-1-(2,4,6-tric...)
Affinity DataIC50:  110nM. Assay description: The enzyme was assayed with substrate GST-Rb in the presence of 50 uM ATP/[gamma-32P] ATP, and capturing the 32-P labeled reaction products on GSH-Se...
In DepthDetails ArticlePubMed
TargetCyclin-dependent kinase 4/G1/S-specific cyclin-D1(Homo sapiens (Human))
Bristol-Myers Squibb
LigandPNGBDBM6017(3-Ethyl-6-(3-methoxy-4-methylbenzyl)-1-(2,4,6-tric...)
Affinity DataIC50:  2.10E+3nM. Assay description: The enzyme was assayed with substrate GST-Rb in the presence of 50 uM ATP/[gamma-32P] ATP, and capturing the 32-P labeled reaction products on GSH-Se...
In DepthDetails ArticlePubMed