BDBM60331 MLS001175542::N-[2-(3,4-dimethoxyphenyl)ethyl]-4-[methyl(phenyl)sulfamoyl]benzamide::N-homoveratryl-4-[methyl(phenyl)sulfamoyl]benzamide::SMR000591917::cid_4784860
SMILES COc1ccc(CCNC(=O)c2ccc(cc2)S(=O)(=O)N(C)c2ccccc2)cc1OC
InChI Key InChIKey=APGNOSBSRLZDSE-UHFFFAOYSA-N
Data  1 IC50
  Tab Delimited (TSV)   2D SDfile   Computed 3D by Vconf -m prep SDfile
Find this compound or compounds like it in BindingDB:
Activity Spreadsheet -- Enzyme Inhibition Constant Data from BindingDB
Found 1 hit for monomerid = 60331
TargetPlectin(Homo sapiens (Human))
Burnham Center For Chemical Genomics
Curated by PubChem BioAssay
LigandPNGBDBM60331(MLS001175542 | N-[2-(3,4-dimethoxyphenyl)ethyl]-4-...)
Affinity DataIC50:  2.00E+5nM. Assay description: Data Source: Sanford-Burnham Center for Chemical Genomics (SBCCG) Source Affiliation: Sanford-Burnham Medical Research Institute (SBMRI, San Diego, C...
In DepthDetails PCBioAssay