BDBM6035 3-(dimethylamino)-1-[4-oxo-3-(thiophen-2-yl)-2H,4H-indeno[1,2-c]pyrazol-5-yl]urea::C3 heterocyle indenopyrazole 8a
SMILES CN(C)NC(=O)Nc1cccc2-c3n[nH]c(-c4cccs4)c3C(=O)c12
InChI Key InChIKey=CNTHYULFGNYUTP-UHFFFAOYSA-N
Data  2 IC50
  Tab Delimited (TSV)   2D SDfile   Computed 3D by Vconf -m prep SDfile
Find this compound or compounds like it in BindingDB:
Activity Spreadsheet -- Enzyme Inhibition Constant Data from BindingDB
Found 2 hits for monomerid = 6035
TargetCyclin-dependent kinase 2/G1/S-specific cyclin-E1(Homo sapiens (Human))
Bristol-Myers Squibb
LigandPNGBDBM6035(3-(dimethylamino)-1-[4-oxo-3-(thiophen-2-yl)-2H,4H...)
Affinity DataIC50:  36nM. Assay description: The enzyme was assayed with substrate GST-Rb in the presence of 50 uM ATP/[gamma-32P] ATP, and capturing the 32-P labeled reaction products on GSH-Se...
In DepthDetails ArticlePubMed
TargetCyclin-dependent kinase 4/G1/S-specific cyclin-D1(Homo sapiens (Human))
Bristol-Myers Squibb
LigandPNGBDBM6035(3-(dimethylamino)-1-[4-oxo-3-(thiophen-2-yl)-2H,4H...)
Affinity DataIC50:  340nMpH: 7.6 T: 2°C. Assay description: The enzyme was assayed with substrate GST-Rb in the presence of 50 uM ATP/[gamma-32P] ATP, and capturing the 32-P labeled reaction products on GSH-Se...
In DepthDetails ArticlePubMed