BDBM60371 MLS000098716::N-(6-amino-1-benzyl-2,4-diketo-pyrimidin-5-yl)-N-ethyl-2-[4-(4-hydroxyphenyl)piperazino]acetamide::N-(6-amino-1-benzyl-2,4-dioxopyrimidin-5-yl)-N-ethyl-2-[4-(4-hydroxyphenyl)piperazin-1-yl]acetamide::N-[6-amino-2,4-dioxo-1-(phenylmethyl)-5-pyrimidinyl]-N-ethyl-2-[4-(4-hydroxyphenyl)-1-piperazinyl]acetamide::N-[6-azanyl-2,4-bis(oxidanylidene)-1-(phenylmethyl)pyrimidin-5-yl]-N-ethyl-2-[4-(4-hydroxyphenyl)piperazin-1-yl]ethanamide::SMR000063752::cid_2124466
SMILES CCN(C(=O)CN1CCN(CC1)c1ccc(O)cc1)c1c(N)n(Cc2ccccc2)c(=O)[nH]c1=O
InChI Key InChIKey=HYVHQTVPZMQYSA-UHFFFAOYSA-N
Data  1 IC50
  Tab Delimited (TSV)   2D SDfile   Computed 3D by Vconf -m prep SDfile
Find this compound or compounds like it in BindingDB:
Activity Spreadsheet -- Enzyme Inhibition Constant Data from BindingDB
Found 1 hit for monomerid = 60371
TargetLarge T antigen(Simian virus 40)
Southern Research Specialized Biocontainment Screening Center
Curated by PubChem BioAssay
LigandPNGBDBM60371(MLS000098716 | N-(6-amino-1-benzyl-2,4-diketo-pyri...)
Affinity DataIC50:  7.74E+3nM. Assay description: A biochemical assay using the ADP-Hunter methodology, purified TAg, and ATP to identify compounds that inhibit the ATPase activity of Tag Southern Re...
In DepthDetails PCBioAssay