BDBM6051 3-[3-(2,4-dimethyl-1,3-thiazol-5-yl)-4-oxo-2H,4H-indeno[1,2-c]pyrazol-5-yl]-1-(4-methylpiperazin-1-yl)urea::C3 heterocyle indenopyrazole 8q
SMILES CN1CCN(CC1)NC(=O)Nc1cccc2-c3n[nH]c(-c4sc(C)nc4C)c3C(=O)c12
InChI Key InChIKey=KRKQVGZXTNLQSV-UHFFFAOYSA-N
Data  2 IC50
PDB links: 1 PDB ID matches this monomer.
  Tab Delimited (TSV)   2D SDfile   Computed 3D by Vconf -m prep SDfile
Find this compound or compounds like it in BindingDB:
Activity Spreadsheet -- Enzyme Inhibition Constant Data from BindingDB
Found 2 hits for monomerid = 6051
TargetCyclin-dependent kinase 2/G1/S-specific cyclin-E1(Homo sapiens (Human))
Bristol-Myers Squibb
LigandPNGBDBM6051(3-[3-(2,4-dimethyl-1,3-thiazol-5-yl)-4-oxo-2H,4H-i...)
Affinity DataIC50:  8nM. Assay description: The enzyme was assayed with substrate GST-Rb in the presence of 50 uM ATP/[gamma-32P] ATP, and capturing the 32-P labeled reaction products on GSH-Se...
TargetCyclin-dependent kinase 4/G1/S-specific cyclin-D1(Homo sapiens (Human))
Bristol-Myers Squibb
LigandPNGBDBM6051(3-[3-(2,4-dimethyl-1,3-thiazol-5-yl)-4-oxo-2H,4H-i...)
Affinity DataIC50:  46nMpH: 7.6 T: 2°C. Assay description: The enzyme was assayed with substrate GST-Rb in the presence of 50 uM ATP/[gamma-32P] ATP, and capturing the 32-P labeled reaction products on GSH-Se...
In DepthDetails ArticlePubMed