BDBM60869 US9174940, 38
SMILES CC(=O)N1c2ccc(NC(=O)CCc3cccc(c3)C(F)(F)F)cc2[C@](C)(CC1(C)C)c1ccccc1
InChI Key InChIKey=YFVXREAECFVSBH-GDLZYMKVSA-N
Data  1 IC50
  Tab Delimited (TSV)   2D SDfile   Computed 3D by Vconf -m prep SDfile
Find this compound or compounds like it in BindingDB:
Activity Spreadsheet -- Enzyme Inhibition Constant Data from BindingDB
Found 1 hit for monomerid = 60869
TargetThyrotropin receptor(Homo sapiens (Human))
Merck Sharp & Dohme
US Patent
LigandPNGBDBM60869(US9174940, 38)
Affinity DataIC50: <100nM. Assay description: Antagonist activity of three test compounds against human TSI at the human TSH receptor was tested in Chinese Hamster Ovary (CHO) cells (cultured 16 ...
In DepthDetails US Patent