BDBM61104 2-hydroxybenzoic acid [(3Z)-2-keto-3-(1,3,3-trimethylindolin-2-ylidene)propyl] ester::2-hydroxybenzoic acid [(3Z)-2-oxo-3-(1,3,3-trimethyl-2-indolylidene)propyl] ester::MLS000776286::SMR000371288::[(3Z)-2-oxidanylidene-3-(1,3,3-trimethylindol-2-ylidene)propyl] 2-oxidanylbenzoate::[(3Z)-2-oxo-3-(1,3,3-trimethylindol-2-ylidene)propyl] 2-hydroxybenzoate::cid_2437548
SMILES CN1C(=CC(=O)COC(=O)c2ccccc2O)C(C)(C)c2ccccc12
InChI Key InChIKey=JXDPRLGHKWZJDY-UHFFFAOYSA-N
Data  1 EC50
  Tab Delimited (TSV)   2D SDfile   Computed 3D by Vconf -m prep SDfile
Find this compound or compounds like it in BindingDB:
Activity Spreadsheet -- Enzyme Inhibition Constant Data from BindingDB
Found 1 hit for monomerid = 61104
TargetG-protein coupled receptor 55(Homo sapiens (Human))
Burnham Center For Chemical Genomics
Curated by PubChem BioAssay
LigandPNGBDBM61104(2-hydroxybenzoic acid [(3Z)-2-keto-3-(1,3,3-trimet...)
Affinity DataEC50:  1.67E+3nM. Assay description: Data Source: Sanford-Burnham Center for Chemical Genomics (SBCCG) Source Affiliation: Sanford-Burnham Medical Research Institute (SBMRI, San Diego, C...
In DepthDetails PCBioAssay