BDBM61282 (4E)-4-[(2-diphenylphosphinothioylhydrazinyl)methylidene]-2,3-bis(oxidanyl)cyclohexa-2,5-dien-1-one::(4E)-4-[(2-diphenylphosphinothioylhydrazinyl)methylidene]-2,3-dihydroxycyclohexa-2,5-dien-1-one::(4E)-4-[(N'-diphenylthiophosphorylhydrazino)methylene]-2,3-dihydroxy-cyclohexa-2,5-dien-1-one::(4E)-4-[(diphenylphosphinothioylhydrazo)methylidene]-2,3-dihydroxy-1-cyclohexa-2,5-dienone::MLS000536518::SMR000151396::cid_6055867
SMILES Oc1ccc(C=NNP(=S)(c2ccccc2)c2ccccc2)c(O)c1O
InChI Key InChIKey=QGDHKQMZPUEQRB-UHFFFAOYSA-N
Data  2 IC50
  Tab Delimited (TSV)   2D SDfile   Computed 3D by Vconf -m prep SDfile
Find this compound or compounds like it in BindingDB:
Activity Spreadsheet -- Enzyme Inhibition Constant Data from BindingDB
Found 2 hits for monomerid = 61282
TargetEukaryotic translation initiation factor 4H(Homo sapiens (Human))
Burnham Center For Chemical Genomics
Curated by PubChem BioAssay
LigandPNGBDBM61282((4E)-4-[(2-diphenylphosphinothioylhydrazinyl)methy...)
Affinity DataIC50:  6.53E+4nM. Assay description: Data Source: Sanford-Burnham Center for Chemical Genomics (SBCCG) Source Affiliation: Sanford-Burnham Medical Research Institute (SBMRI, San Diego, C...
In DepthDetails PCBioAssay
TargetPolyadenylate-binding protein 1(Homo sapiens (Human))
Burnham Center For Chemical Genomics
Curated by PubChem BioAssay
LigandPNGBDBM61282((4E)-4-[(2-diphenylphosphinothioylhydrazinyl)methy...)
Affinity DataIC50:  1.00E+5nM. Assay description: Data Source: Sanford-Burnham Center for Chemical Genomics (SBCCG) Source Affiliation: Sanford-Burnham Medical Research Institute (SBMRI, San Diego, C...
In DepthDetails PCBioAssay