BDBM61313 10-hydroxy-11-(4-methyl-4-morpholin-4-iumyl)undecanoic acid methyl ester;iodide::10-hydroxy-11-(4-methylmorpholin-4-ium-4-yl)undecanoic acid methyl ester;iodide::4-(2-Hydroxy-10-methoxycarbonyl-decyl)-4-methyl-morpholin-4-ium::MLS001030075::SMR000427263::cid_16682274::methyl 10-hydroxy-11-(4-methylmorpholin-4-ium-4-yl)undecanoate;iodide::methyl 11-(4-methylmorpholin-4-ium-4-yl)-10-oxidanyl-undecanoate;iodide
SMILES COC(=O)CCCCCCCCC(O)C[N+]1(C)CCOCC1
InChI Key InChIKey=UZVSSGIULGHDLK-UHFFFAOYSA-N
Data  4 IC50
  Tab Delimited (TSV)   2D SDfile   Computed 3D by Vconf -m prep SDfile
Find this compound or compounds like it in BindingDB:
Activity Spreadsheet -- Enzyme Inhibition Constant Data from BindingDB
Found 4 hits for monomerid = 61313
TargetPolyadenylate-binding protein 1(Homo sapiens (Human))
Burnham Center For Chemical Genomics
Curated by PubChem BioAssay
LigandPNGBDBM61313(10-hydroxy-11-(4-methyl-4-morpholin-4-iumyl)undeca...)
Affinity DataIC50:  2.48E+3nM. Assay description: Data Source: Sanford-Burnham Center for Chemical Genomics (SBCCG) Source Affiliation: Sanford-Burnham Medical Research Institute (SBMRI, San Diego, C...
In DepthDetails PCBioAssay
TargetDNA dC->dU-editing enzyme APOBEC-3G(Homo sapiens (Human))
Burnham Center For Chemical Genomics
Curated by PubChem BioAssay
LigandPNGBDBM61313(10-hydroxy-11-(4-methyl-4-morpholin-4-iumyl)undeca...)
Affinity DataIC50:  3.49E+3nMT: 2°C. Assay description: Data Source: Sanford-Burnham Center for Chemical Genomics (SBCCG) Source Affiliation: Sanford-Burnham Medical Research Institute (SBMRI, San Diego, C...
In DepthDetails PCBioAssay
TargetDNA dC->dU-editing enzyme APOBEC-3A(Homo sapiens (Human))
Burnham Center For Chemical Genomics
Curated by PubChem BioAssay
LigandPNGBDBM61313(10-hydroxy-11-(4-methyl-4-morpholin-4-iumyl)undeca...)
Affinity DataIC50:  2.36E+3nMT: 2°C. Assay description: Data Source: Sanford-Burnham Center for Chemical Genomics (SBCCG) Source Affiliation: Sanford-Burnham Medical Research Institute (SBMRI, San Diego, C...
In DepthDetails PCBioAssay
TargetEukaryotic translation initiation factor 4H(Homo sapiens (Human))
Burnham Center For Chemical Genomics
Curated by PubChem BioAssay
LigandPNGBDBM61313(10-hydroxy-11-(4-methyl-4-morpholin-4-iumyl)undeca...)
Affinity DataIC50:  1.00E+5nM. Assay description: Data Source: Sanford-Burnham Center for Chemical Genomics (SBCCG) Source Affiliation: Sanford-Burnham Medical Research Institute (SBMRI, San Diego, C...
In DepthDetails PCBioAssay