BDBM61481 3-methyl-N-[2,2,2-trichloro-1-(4-chlorophenoxy)ethyl]butanamide::3-methyl-N-[2,2,2-trichloro-1-(4-chlorophenoxy)ethyl]butyramide::3-methyl-N-[2,2,2-tris(chloranyl)-1-(4-chloranylphenoxy)ethyl]butanamide::MLS000573745::SMR000184593::cid_2831117
SMILES CC(C)CC(=O)NC(Oc1ccc(Cl)cc1)C(Cl)(Cl)Cl
InChI Key InChIKey=VOYPJSYWOFJREE-UHFFFAOYSA-N
Data  1 IC50
  Tab Delimited (TSV)   2D SDfile   Computed 3D by Vconf -m prep SDfile
Find this compound or compounds like it in BindingDB:
Activity Spreadsheet -- Enzyme Inhibition Constant Data from BindingDB
Found 1 hit for monomerid = 61481
TargetG-protein coupled receptor 55(Homo sapiens (Human))
Burnham Center For Chemical Genomics
Curated by PubChem BioAssay
LigandPNGBDBM61481(3-methyl-N-[2,2,2-trichloro-1-(4-chlorophenoxy)eth...)
Affinity DataIC50:  1.17E+3nM. Assay description: Data Source: Sanford-Burnham Center for Chemical Genomics (SBCCG) Source Affiliation: Sanford-Burnham Medical Research Institute (SBMRI, San Diego, C...
In DepthDetails PCBioAssay