BDBM61640 (4-fluorobenzyl)-(6-methoxy-2-methyl-4-quinolyl)amine::MLS001173050::N-[(4-fluorophenyl)methyl]-6-methoxy-2-methyl-4-quinolinamine::N-[(4-fluorophenyl)methyl]-6-methoxy-2-methyl-quinolin-4-amine::N-[(4-fluorophenyl)methyl]-6-methoxy-2-methylquinolin-4-amine::SMR000590021::cid_4798059
SMILES COc1ccc2nc(C)cc(NCc3ccc(F)cc3)c2c1
InChI Key InChIKey=NWJCMSSQJWHTAI-UHFFFAOYSA-N
Data  1 IC50
  Tab Delimited (TSV)   2D SDfile   Computed 3D by Vconf -m prep SDfile
Find this compound or compounds like it in BindingDB:
Activity Spreadsheet -- Enzyme Inhibition Constant Data from BindingDB
Found 1 hit for monomerid = 61640
TargetG-protein coupled receptor 35(Homo sapiens (Human))
Burnham Center For Chemical Genomics
Curated by PubChem BioAssay
LigandPNGBDBM61640((4-fluorobenzyl)-(6-methoxy-2-methyl-4-quinolyl)am...)
Affinity DataIC50:  2.60E+3nM. Assay description: Data Source: Sanford-Burnham Center for Chemical Genomics (SBCCG) Source Affiliation: Sanford-Burnham Medical Research Institute (SBMRI, San Diego, C...
In DepthDetails PCBioAssay