BDBM61753 1-[5,6-dichloro-1-(4-methylbenzyl)benzimidazol-2-yl]ethyl-[4-(p-tolyl)thiazol-2-yl]amine::MLS000888931::N-[1-[5,6-bis(chloranyl)-1-[(4-methylphenyl)methyl]benzimidazol-2-yl]ethyl]-4-(4-methylphenyl)-1,3-thiazol-2-amine::N-[1-[5,6-dichloro-1-[(4-methylphenyl)methyl]-2-benzimidazolyl]ethyl]-4-(4-methylphenyl)-2-thiazolamine::N-[1-[5,6-dichloro-1-[(4-methylphenyl)methyl]benzimidazol-2-yl]ethyl]-4-(4-methylphenyl)-1,3-thiazol-2-amine::SMR000673909::cid_24793603::{1-[5,6-Dichloro-1-(4-methyl-benzyl)-1H-benzoimidazol-2-yl]-ethyl}-(4-p-tolyl-thiazol-2-yl)-amine
SMILES CC(Nc1nc(cs1)-c1ccc(C)cc1)c1nc2cc(Cl)c(Cl)cc2n1Cc1ccc(C)cc1
InChI Key InChIKey=IVLYTCLGHVRWSZ-UHFFFAOYSA-N
Data  4 IC50
  Tab Delimited (TSV)   2D SDfile   Computed 3D by Vconf -m prep SDfile
Find this compound or compounds like it in BindingDB:
Activity Spreadsheet -- Enzyme Inhibition Constant Data from BindingDB
Found 4 hits for monomerid = 61753
TargetVoltage-dependent N-type calcium channel subunit alpha-1B(Homo sapiens (Human))
Burnham Center For Chemical Genomics
Curated by PubChem BioAssay
LigandPNGBDBM61753(1-[5,6-dichloro-1-(4-methylbenzyl)benzimidazol-2-y...)
Affinity DataIC50:  4.57E+3nM. Assay description: Data Source: Data Source: Sanford-Burnham Center for Chemical Genomics (SBCCG) Source Affiliation: Sanford-Burnham Medical Research Institute Network...
In DepthDetails PCBioAssay
TargetBeta-lactamase(Pseudomonas aeruginosa)
The Scripps Research Institute Molecular Screening Center
Curated by PubChem BioAssay
LigandPNGBDBM61753(1-[5,6-dichloro-1-(4-methylbenzyl)benzimidazol-2-y...)
Affinity DataIC50: >5.96E+4nM. Assay description: Source (MLPCN Center Name): The Scripps Research Institute Molecular Screening Center (SRIMSC) Center Affiliation: The Scripps Research Institute (TS...
In DepthDetails PCBioAssay
TargetBeta-lactamase(Salmonella enterica subsp. enterica serovar Choler...)
The Scripps Research Institute Molecular Screening Center
Curated by PubChem BioAssay
LigandPNGBDBM61753(1-[5,6-dichloro-1-(4-methylbenzyl)benzimidazol-2-y...)
Affinity DataIC50: >5.96E+4nM. Assay description: Source (MLPCN Center Name): The Scripps Research Institute Molecular Screening Center (SRIMSC) Center Affiliation: The Scripps Research Institute (TS...
In DepthDetails PCBioAssay
TargetBeta-lactamase(Pseudomonas aeruginosa)
The Scripps Research Institute Molecular Screening Center
Curated by PubChem BioAssay
LigandPNGBDBM61753(1-[5,6-dichloro-1-(4-methylbenzyl)benzimidazol-2-y...)
Affinity DataIC50:  2.52E+4nM. Assay description: Source (MLPCN Center Name): The Scripps Research Institute Molecular Screening Center (SRIMSC) Center Affiliation: The Scripps Research Institute (TS...
In DepthDetails PCBioAssay