BDBM61854 4-Amino-benzoic acid [2-hydroxy-5-(naphthalen-1-ylazo)-benzylidene]-hydrazide::4-amino-N-[[(3E)-3-(1-naphthalenylhydrazinylidene)-6-oxo-1-cyclohexa-1,4-dienyl]methylideneamino]benzamide::4-amino-N-[[(3E)-3-(naphthalen-1-ylhydrazinylidene)-6-oxocyclohexa-1,4-dien-1-yl]methylideneamino]benzamide::4-amino-N-[[(3E)-6-keto-3-(1-naphthylhydrazono)cyclohexa-1,4-dien-1-yl]methyleneamino]benzamide::4-azanyl-N-[[(3E)-3-(naphthalen-1-ylhydrazinylidene)-6-oxidanylidene-cyclohexa-1,4-dien-1-yl]methylideneamino]benzamide::MLS000523252::SMR000123230::cid_9549351
SMILES Nc1ccc(cc1)C(=O)NN=Cc1cc(ccc1O)N=Nc1cccc2ccccc12
InChI Key InChIKey=DQKGBPUXEVJYAB-UHFFFAOYSA-N
Data  2 IC50
  Tab Delimited (TSV)   2D SDfile   Computed 3D by Vconf -m prep SDfile
Find this compound or compounds like it in BindingDB:
Activity Spreadsheet -- Enzyme Inhibition Constant Data from BindingDB
Found 2 hits for monomerid = 61854
TargetBcl-2-like protein 1(Homo sapiens (Human))
The Scripps Research Institute Molecular Screening Center
Curated by PubChem BioAssay
LigandPNGBDBM61854(4-Amino-benzoic acid [2-hydroxy-5-(naphthalen-1-yl...)
Affinity DataIC50:  1.09E+5nM. Assay description: Source (MLPCN Center Name): The Scripps Research Institute Molecular Screening Center Affiliation: The Scripps Research Institute, TSRI Assay Provide...
In DepthDetails PCBioAssay
TargetInduced myeloid leukemia cell differentiation protein Mcl-1(Homo sapiens (Human))
The Scripps Research Institute Molecular Screening Center
Curated by PubChem BioAssay
LigandPNGBDBM61854(4-Amino-benzoic acid [2-hydroxy-5-(naphthalen-1-yl...)
Affinity DataIC50:  6.84E+3nM. Assay description: Source (MLPCN Center Name): The Scripps Research Institute Molecular Screening Center Affiliation: The Scripps Research Institute, TSRI Assay Provide...
In DepthDetails PCBioAssay