BDBM61966 KSC-09-149B::KUC105615N::N-(2-chlorophenyl)-2-(3-keto-1,2-benzothiazol-2-yl)acetamide::N-(2-chlorophenyl)-2-(3-keto-1,2-benzothiazol-2-yl)acetamide (4)::N-(2-chlorophenyl)-2-(3-oxidanylidene-1,2-benzothiazol-2-yl)ethanamide::N-(2-chlorophenyl)-2-(3-oxo-1,2-benzothiazol-2-yl)acetamide::cid_45479199
SMILES Clc1ccccc1NC(=O)Cn1sc2ccccc2c1=O
InChI Key InChIKey=YXMUHEZLRNKKLP-UHFFFAOYSA-N
Data  3 IC50
  Tab Delimited (TSV)   2D SDfile   Computed 3D by Vconf -m prep SDfile
Find this compound or compounds like it in BindingDB:
Activity Spreadsheet -- Enzyme Inhibition Constant Data from BindingDB
Found 3 hits for monomerid = 61966
TargetGlucose-6-phosphate 1-dehydrogenase(Leuconostoc mesenteroides)
University Of Pittsburgh
Curated by PubChem BioAssay
LigandPNGBDBM61966(KSC-09-149B | KUC105615N | N-(2-chlorophenyl)-2-(3...)
Affinity DataIC50: >2.50E+4nM. Assay description: Excerpt from MH082340 application (Dr. James Morris, Clemson University) Trypanosoma brucei, the digenic protozoan parasite that causes African sleep...
In DepthDetails PCBioAssay
TargetGenome polyprotein(Hepatitis C virus)
University Of Wisconsin-Milwaukee
LigandPNGBDBM61966(KSC-09-149B | KUC105615N | N-(2-chlorophenyl)-2-(3...)
Affinity DataIC50:  1.90E+3nMpH: 7.5 T: 2°C. Assay description: Binding assays containing 25 mM MOPS pH 7.5, 1.25 mM MgCl2, 20 nM Cy5-dT15, and 200 nM NS3h_1b were incubated 5 min at RT. Following addition of indi...
In DepthDetails ArticlePubMed
TargetPhosphotransferase(Trypanosoma brucei)
University Of Pittsburgh
Curated by PubChem BioAssay
LigandPNGBDBM61966(KSC-09-149B | KUC105615N | N-(2-chlorophenyl)-2-(3...)
Affinity DataIC50:  4.16E+3nM. Assay description: Excerpt from MH0882340 application (Dr. James Morris, Clemson University) Trypanosoma brucei, the digenic protozoan parasite that causes African slee...
In DepthDetails PCBioAssay