BDBM61988 KSC-6-261::KUC105791N::N-(5-chloranyl-2-sulfamoyl-phenyl)-4-methoxy-benzamide::N-(5-chloro-2-sulfamoyl-phenyl)-4-methoxy-benzamide::N-(5-chloro-2-sulfamoylphenyl)-4-methoxybenzamide::cid_46173039
SMILES COc1ccc(cc1)C(=O)Nc1cc(Cl)ccc1S(N)(=O)=O
InChI Key InChIKey=BDBVNQMTBXGGRX-UHFFFAOYSA-N
Data  2 IC50
  Tab Delimited (TSV)   2D SDfile   Computed 3D by Vconf -m prep SDfile
Find this compound or compounds like it in BindingDB:
Activity Spreadsheet -- Enzyme Inhibition Constant Data from BindingDB
Found 2 hits for monomerid = 61988
TargetPhosphotransferase(Trypanosoma brucei)
University Of Pittsburgh
Curated by PubChem BioAssay
LigandPNGBDBM61988(KSC-6-261 | KUC105791N | N-(5-chloranyl-2-sulfamoy...)
Affinity DataIC50:  2.50E+4nM. Assay description: Excerpt from MH0882340 application (Dr. James Morris, Clemson University) Trypanosoma brucei, the digenic protozoan parasite that causes African slee...
Ligand InfoPC cidPC sid
In DepthDetails PCBioAssay
TargetGlucose-6-phosphate 1-dehydrogenase(Leuconostoc mesenteroides)
University Of Pittsburgh
Curated by PubChem BioAssay
LigandPNGBDBM61988(KSC-6-261 | KUC105791N | N-(5-chloranyl-2-sulfamoy...)
Affinity DataIC50: >2.50E+4nM. Assay description: Excerpt from MH082340 application (Dr. James Morris, Clemson University) Trypanosoma brucei, the digenic protozoan parasite that causes African sleep...
Ligand InfoPC cidPC sid
In DepthDetails PCBioAssay