BDBM61999 2-[(2-carboxyanilino)-oxomethyl]benzoic acid::2-[(2-carboxyphenyl)carbamoyl]benzoic acid::KSC-6-277::KUC105911N::cid_4307742
SMILES OC(=O)c1ccccc1NC(=O)c1ccccc1C(O)=O
InChI Key InChIKey=HZSXOMSYRGNSJA-UHFFFAOYSA-N
Data  2 IC50
  Tab Delimited (TSV)   2D SDfile   Computed 3D by Vconf -m prep SDfile
Find this compound or compounds like it in BindingDB:
Activity Spreadsheet -- Enzyme Inhibition Constant Data from BindingDB
Found 2 hits for monomerid = 61999
TargetPhosphotransferase(Trypanosoma brucei)
University Of Pittsburgh
Curated by PubChem BioAssay
LigandPNGBDBM61999(2-[(2-carboxyanilino)-oxomethyl]benzoic acid | 2-[...)
Affinity DataIC50:  2.50E+4nM. Assay description: Excerpt from MH0882340 application (Dr. James Morris, Clemson University) Trypanosoma brucei, the digenic protozoan parasite that causes African slee...
In DepthDetails PCBioAssay
TargetGlucose-6-phosphate 1-dehydrogenase(Leuconostoc mesenteroides)
University Of Pittsburgh
Curated by PubChem BioAssay
LigandPNGBDBM61999(2-[(2-carboxyanilino)-oxomethyl]benzoic acid | 2-[...)
Affinity DataIC50: >2.50E+4nM. Assay description: Excerpt from MH082340 application (Dr. James Morris, Clemson University) Trypanosoma brucei, the digenic protozoan parasite that causes African sleep...
In DepthDetails PCBioAssay