BDBM62042 2-(p-anisoylamino)benzoic acid::2-[(4-methoxybenzoyl)amino]benzoic acid::2-[(4-methoxyphenyl)carbonylamino]benzoic acid::2-[[(4-methoxyphenyl)-oxomethyl]amino]benzoic acid::KSC-20-006::KUC106458N::cid_721421
SMILES COc1ccc(cc1)C(=O)Nc1ccccc1C(O)=O
InChI Key InChIKey=FWDOQXWBHGKWRK-UHFFFAOYSA-N
Data  3 IC50
  Tab Delimited (TSV)   2D SDfile   Computed 3D by Vconf -m prep SDfile
Find this compound or compounds like it in BindingDB:
Activity Spreadsheet -- Enzyme Inhibition Constant Data from BindingDB
Found 3 hits for monomerid = 62042
TargetGlucose-6-phosphate 1-dehydrogenase(Leuconostoc mesenteroides)
University Of Pittsburgh
Curated by PubChem BioAssay
LigandPNGBDBM62042(2-(p-anisoylamino)benzoic acid | 2-[(4-methoxybenz...)
Affinity DataIC50: >2.50E+4nM. Assay description: Excerpt from MH082340 application (Dr. James Morris, Clemson University) Trypanosoma brucei, the digenic protozoan parasite that causes African sleep...
In DepthDetails PCBioAssay
TargetLactoylglutathione lyase(Homo sapiens (Human))
Tokyo University Of Science
Curated by ChEMBL
LigandPNGBDBM62042(2-(p-anisoylamino)benzoic acid | 2-[(4-methoxybenz...)
Affinity DataIC50:  9.32E+4nM. Assay description: Inhibition of recombinant human His-tagged glyoxalase 1 expressed in Escherichia coli BL21 assessed as formation of S-D-lactoylglutathione after 5 mi...
In DepthDetails ArticlePubMed
TargetPhosphotransferase(Trypanosoma brucei)
University Of Pittsburgh
Curated by PubChem BioAssay
LigandPNGBDBM62042(2-(p-anisoylamino)benzoic acid | 2-[(4-methoxybenz...)
Affinity DataIC50:  2.50E+4nM. Assay description: Excerpt from MH0882340 application (Dr. James Morris, Clemson University) Trypanosoma brucei, the digenic protozoan parasite that causes African slee...
In DepthDetails PCBioAssay