BDBM62059 2-(5-Benzyl-4-furan-2-ylmethyl-4H-[1,2,4]triazol-3-ylsulfanyl)-N-cyclopentyl-acetamide::2-[[5-benzyl-4-(2-furfuryl)-1,2,4-triazol-3-yl]thio]-N-cyclopentyl-acetamide::2-[[5-benzyl-4-(furan-2-ylmethyl)-1,2,4-triazol-3-yl]sulfanyl]-N-cyclopentylacetamide::MLS000073416::N-cyclopentyl-2-[[4-(2-furanylmethyl)-5-(phenylmethyl)-1,2,4-triazol-3-yl]thio]acetamide::N-cyclopentyl-2-[[4-(furan-2-ylmethyl)-5-(phenylmethyl)-1,2,4-triazol-3-yl]sulfanyl]ethanamide::SMR000002762::cid_646976
SMILES O=C(CSc1nnc(Cc2ccccc2)n1Cc1ccco1)NC1CCCC1
InChI Key InChIKey=GUOHQQVAMZJYCT-UHFFFAOYSA-N
Data  1 IC50
  Tab Delimited (TSV)   2D SDfile   Computed 3D by Vconf -m prep SDfile
Find this compound or compounds like it in BindingDB:
Activity Spreadsheet -- Enzyme Inhibition Constant Data from BindingDB
Found 1 hit for monomerid = 62059
TargetNeuropeptides B/W receptor type 1(Homo sapiens (Human))
The Scripps Research Institute Molecular Screening Center
Curated by PubChem BioAssay
LigandPNGBDBM62059(2-(5-Benzyl-4-furan-2-ylmethyl-4H-[1,2,4]triazol-3...)
Affinity DataIC50:  4.38E+4nM. Assay description: Source (MLPCN Center Name): The Scripps Research Institute Molecular Screening Center (SRIMSC) Affiliation: The Scripps Research Institute, TSRI Assa...
In DepthDetails PCBioAssay