BDBM62094 Benzoic acid 4-{[2-(2,6-dimethyl-4-nitro-phenoxy)-acetyl]-hydrazonomethyl}-phenyl ester::MLS000567003::SMR000174230::[4-[[2-(2,6-dimethyl-4-nitro-phenoxy)ethanoylhydrazinylidene]methyl]phenyl] benzoate::[4-[[[2-(2,6-dimethyl-4-nitrophenoxy)acetyl]hydrazinylidene]methyl]phenyl] benzoate::benzoic acid [4-[[[2-(2,6-dimethyl-4-nitro-phenoxy)acetyl]hydrazono]methyl]phenyl] ester::benzoic acid [4-[[[2-(2,6-dimethyl-4-nitrophenoxy)-1-oxoethyl]hydrazinylidene]methyl]phenyl] ester::cid_1138091
SMILES Cc1cc(cc(C)c1OCC(=O)NN=Cc1ccc(OC(=O)c2ccccc2)cc1)[N+]([O-])=O
InChI Key InChIKey=JSTBBLDUEFOWTR-UHFFFAOYSA-N
Data  1 IC50
  Tab Delimited (TSV)   2D SDfile   Computed 3D by Vconf -m prep SDfile
Find this compound or compounds like it in BindingDB:
Activity Spreadsheet -- Enzyme Inhibition Constant Data from BindingDB
Found 1 hit for monomerid = 62094
TargetNeuropeptides B/W receptor type 1(Homo sapiens (Human))
The Scripps Research Institute Molecular Screening Center
Curated by PubChem BioAssay
LigandPNGBDBM62094(Benzoic acid 4-{[2-(2,6-dimethyl-4-nitro-phenoxy)-...)
Affinity DataIC50:  2.80E+4nM. Assay description: Source (MLPCN Center Name): The Scripps Research Institute Molecular Screening Center (SRIMSC) Affiliation: The Scripps Research Institute, TSRI Assa...
Ligand InfoPC cidPC sid
In DepthDetails PCBioAssay