BDBM6211 Benzodioxole deriv. 20::N-(5-Bromo-1,3-benzodioxol-4-yl)-6-methoxy-7-(3-morpholin-4-ylpropoxy)quinazolin-4-amine::N-(5-bromo-2H-1,3-benzodioxol-4-yl)-6-methoxy-7-[3-(morpholin-4-yl)propoxy]quinazolin-4-amine
SMILES COc1cc2c(Nc3c4OCOc4ccc3Br)ncnc2cc1OCCCN1CCOCC1
InChI Key InChIKey=DKAYYTAEGKGYQO-UHFFFAOYSA-N
Data  2 IC50
  Tab Delimited (TSV)   2D SDfile   Computed 3D by Vconf -m prep SDfile
Find this compound or compounds like it in BindingDB:
Activity Spreadsheet -- Enzyme Inhibition Constant Data from BindingDB
Found 2 hits for monomerid = 6211
TargetVascular endothelial growth factor receptor 2(Homo sapiens (Human))
Astrazeneca
LigandPNGBDBM6211(Benzodioxole deriv. 20 | N-(5-Bromo-1,3-benzodioxo...)
Affinity DataIC50:  4.26E+4nM. Assay description: An ELISA assay was used to determine the ability of inhibitor to inhibit receptor tyrosine kinase activity. The compounds were incubated with enzym...
In DepthDetails ArticlePubMed
TargetProto-oncogene tyrosine-protein kinase Src(Homo sapiens (Human))
Astrazeneca
LigandPNGBDBM6211(Benzodioxole deriv. 20 | N-(5-Bromo-1,3-benzodioxo...)
Affinity DataIC50: <4nM. Assay description: This assay determines the ability of test compounds to inhibit Src kinase activity that catalyzes the transfer of the terminal phosphate to the immob...
In DepthDetails ArticlePubMed