BDBM62111 (3aS,5S,9aS)-5-[3-(4-fluorophenyl)-1H-pyrazol-4-yl]-2-(2-methylbenzyl)hexahydro-7H-pyrrolo[3,4-g]pyrrolizin-1(2H)-one::(3aS,5S,9aS)-5-[5-(4-fluorophenyl)-1H-pyrazol-4-yl]-2-(2-methylbenzyl)-3a,4,5,7,8,9-hexahydro-3H-pyrrolo[3,4-h]pyrrolizin-1-one::(3aS,5S,9aS)-5-[5-(4-fluorophenyl)-1H-pyrazol-4-yl]-2-[(2-methylphenyl)methyl]-3a,4,5,7,8,9-hexahydro-3H-pyrrolo[3,4-h]pyrrolizin-1-one::MLS000735401::SMR000318239::cid_16192403
SMILES Cc1ccccc1CN1C[C@@H]2C[C@H](N3CCC[C@@]23C1=O)c1c[nH]nc1-c1ccc(F)cc1
InChI Key InChIKey=RMFCVBYMXICUJN-CHZKFRDHSA-N
Data  1 IC50
  Tab Delimited (TSV)   2D SDfile   Computed 3D by Vconf -m prep SDfile
Find this compound or compounds like it in BindingDB:
Activity Spreadsheet -- Enzyme Inhibition Constant Data from BindingDB
Found 1 hit for monomerid = 62111
TargetNeuropeptides B/W receptor type 1(Homo sapiens (Human))
The Scripps Research Institute Molecular Screening Center
Curated by PubChem BioAssay
LigandPNGBDBM62111((3aS,5S,9aS)-5-[3-(4-fluorophenyl)-1H-pyrazol-4-yl...)
Affinity DataIC50:  1.06E+4nM. Assay description: Source (MLPCN Center Name): The Scripps Research Institute Molecular Screening Center (SRIMSC) Affiliation: The Scripps Research Institute, TSRI Assa...
Ligand InfoPC cidPC sid
In DepthDetails PCBioAssay