BDBM62128 5-(4-chlorophenyl)-N-(3-pyridinylmethyl)-2-(trifluoromethyl)-3-furamide::5-(4-chlorophenyl)-N-(3-pyridinylmethyl)-2-(trifluoromethyl)-3-furancarboxamide::5-(4-chlorophenyl)-N-(3-pyridylmethyl)-2-(trifluoromethyl)-3-furamide::5-(4-chlorophenyl)-N-(pyridin-3-ylmethyl)-2-(trifluoromethyl)furan-3-carboxamide::MLS000830221::SMR000458142::cid_2810388
SMILES FC(F)(F)c1oc(cc1C(=O)NCc1cccnc1)-c1ccc(Cl)cc1
InChI Key InChIKey=UIXFEIWGHZATAO-UHFFFAOYSA-N
Data  1 IC50
  Tab Delimited (TSV)   2D SDfile   Computed 3D by Vconf -m prep SDfile
Find this compound or compounds like it in BindingDB:
Activity Spreadsheet -- Enzyme Inhibition Constant Data from BindingDB
Found 1 hit for monomerid = 62128
TargetNeuropeptides B/W receptor type 1(Homo sapiens (Human))
The Scripps Research Institute Molecular Screening Center
Curated by PubChem BioAssay
LigandPNGBDBM62128(5-(4-chlorophenyl)-N-(3-pyridinylmethyl)-2-(triflu...)
Affinity DataIC50:  1.46E+4nM. Assay description: Source (MLPCN Center Name): The Scripps Research Institute Molecular Screening Center (SRIMSC) Affiliation: The Scripps Research Institute, TSRI Assa...
In DepthDetails PCBioAssay