BDBM62138 MLS001199098::N-[2-(diethylamino)ethyl]-3-[3,4,6-trimethyl-1-(4-methylphenyl)-1H-pyrazolo[3,4-b]pyridin-5-yl]propanamide::N-[2-(diethylamino)ethyl]-3-[3,4,6-trimethyl-1-(4-methylphenyl)-5-pyrazolo[3,4-b]pyridinyl]propanamide::N-[2-(diethylamino)ethyl]-3-[3,4,6-trimethyl-1-(4-methylphenyl)pyrazolo[3,4-b]pyridin-5-yl]propanamide::N-[2-(diethylamino)ethyl]-3-[3,4,6-trimethyl-1-(p-tolyl)pyrazolo[3,4-b]pyridin-5-yl]propionamide::SMR000563225::cid_23603500
SMILES CCN(CC)CCNC(=O)CCc1c(C)nc2n(nc(C)c2c1C)-c1ccc(C)cc1
InChI Key InChIKey=CRZGIBBJIJHGEQ-UHFFFAOYSA-N
Data  1 IC50
  Tab Delimited (TSV)   2D SDfile   Computed 3D by Vconf -m prep SDfile
Find this compound or compounds like it in BindingDB:
Activity Spreadsheet -- Enzyme Inhibition Constant Data from BindingDB
Found 1 hit for monomerid = 62138
TargetNeuropeptides B/W receptor type 1(Homo sapiens (Human))
The Scripps Research Institute Molecular Screening Center
Curated by PubChem BioAssay
LigandPNGBDBM62138(MLS001199098 | N-[2-(diethylamino)ethyl]-3-[3,4,6-...)
Affinity DataIC50:  1.03E+4nM. Assay description: Source (MLPCN Center Name): The Scripps Research Institute Molecular Screening Center (SRIMSC) Affiliation: The Scripps Research Institute, TSRI Assa...
In DepthDetails PCBioAssay